{"text_format":"1","workbook":"xlsx","n_sheets":6,"sheets":["入力用紙","繁殖状況票","アンケート調査用紙","調査用紙","入力制限シート","Sheet3"],"not_rendered":{"charts":0,"images":0,"macros":1,"external_links":0,"defined_names":0,"comments":0,"pivot_tables":1},"unopened":[],"bounds":{"document_bytes":16777216,"sheet_cells":100000,"rows_first":2000,"rows_last":500,"rows_between":2000,"halvings":0,"cell_chars":16384,"cell_head_chars":4096},"cells_cut":0,"cells_raw":0,"read":"whole","date_system":"1900"}

{"sheet":"入力用紙","index":0,"n_rows":256,"n_cols":8,"rows_kept":256,"cut":false,"hidden":false,"merged":[[0,0,0,7],[7,3,7,5],[5,4,5,7]]}
["全国鳥類繁殖分布調査　調査用紙"]
["青く塗った部分に入力ください"]
["調査ルート番号"]
["調査年月日",null,null,"年",null,"月",null,"日"]
["調査時刻",null,null,"～",null,null,"天候"]
["調査責任者",null,null,"ほか"]
[]
[null,null,null,"個体数"]
["調査種別","時刻","種名","50ｍ内","以遠","幼","合計","繁殖行動"]
[null,null,null,null,null,null,{"$f":"IF(SUM(D10:F10)=0,\"\",SUM(D10:F10))","v":""},"さえずり・餌運搬・"]
[null,null,null,null,null,null,{"$f":"IF(SUM(D11:F11)=0,\"\",SUM(D11:F11))","v":""},"さえずり・餌運搬・"]
[null,null,null,null,null,null,"","さえずり・餌運搬・"]
[null,null,null,null,null,null,"","さえずり・餌運搬・"]
[null,null,null,null,null,null,"","さえずり・餌運搬・"]
[null,null,null,null,null,null,"","さえずり・餌運搬・"]
[null,null,null,null,null,null,"","さえずり・餌運搬・"]
[null,null,null,null,null,null,"","さえずり・餌運搬・"]
[null,null,null,null,null,null,"","さえずり・餌運搬・"]
[null,null,null,null,null,null,"","さえずり・餌運搬・"]
[null,null,null,null,null,null,"","さえずり・餌運搬・"]
[null,null,null,null,null,null,"","さえずり・餌運搬・"]
[null,null,null,null,null,null,"","さえずり・餌運搬・"]
[null,null,null,null,null,null,"","さえずり・餌運搬・"]
[null,null,null,null,null,null,"","さえずり・餌運搬・"]
[null,null,null,null,null,null,"","さえずり・餌運搬・"]
[null,null,null,null,null,null,"","さえずり・餌運搬・"]
[null,null,null,null,null,null,"","さえずり・餌運搬・"]
[null,null,null,null,null,null,"","さえずり・餌運搬・"]
[null,null,null,null,null,null,"","さえずり・餌運搬・"]
[null,null,null,null,null,null,"","さえずり・餌運搬・"]
[null,null,null,null,null,null,"","さえずり・餌運搬・"]
[null,null,null,null,null,null,"","さえずり・餌運搬・"]
[null,null,null,null,null,null,"","さえずり・餌運搬・"]
[null,null,null,null,null,null,"","さえずり・餌運搬・"]
[null,null,null,null,null,null,"","さえずり・餌運搬・"]
[null,null,null,null,null,null,"","さえずり・餌運搬・"]
[null,null,null,null,null,null,"","さえずり・餌運搬・"]
[null,null,null,null,null,null,"","さえずり・餌運搬・"]
[null,null,null,null,null,null,"","さえずり・餌運搬・"]
[null,null,null,null,null,null,"","さえずり・餌運搬・"]
{"$rows_left_out":217}
{"sheet":"繁殖状況票","index":1,"n_rows":129,"n_cols":9,"rows_kept":129,"cut":false,"hidden":false,"merged":[]}
["調査コース","調査年月日","調査時刻","天候","調査責任者","ほか"]
[{"$f":"入力用紙!C3","v":0},{"$f":"入力用紙!C4*10000+入力用紙!E4*100+入力用紙!G4","v":0},{"$f":"入力用紙!C5&\"-\"&入力用紙!E5","v":"-"},{"$f":"入力用紙!H5","v":0},{"$f":"入力用紙!C6","v":0},{"$f":"入力用紙!E6","v":0}]
[null,null,"青く塗った部分に入力ください"]
[null,null,"データ"]
["調査種別","種名","合計 / 50ｍ内","合計 / 以遠","合計 / 幼","合計 / 合計","繁殖区分","観察コード","繁殖ランク"]
["(空白)","(空白)",null,null,null,0,null,{"$f":"IF(G6=\"\",\"\",VLOOKUP(G6,入力制限シート!A$7:C$33,2,FALSE))","v":""},{"$f":"IF(G6=\"\",\"\",VLOOKUP(G6,入力制限シート!A$7:C$33,3,FALSE))","v":""}]
["(空白) 集計",null,null,null,null,0,null,{"$f":"IF(G7=\"\",\"\",VLOOKUP(G7,入力制限シート!A$7:C$33,2,FALSE))","v":""},{"$f":"IF(G7=\"\",\"\",VLOOKUP(G7,入力制限シート!A$7:C$33,3,FALSE))","v":""}]
["総計",null,null,null,null,0,null,{"$f":"IF(G8=\"\",\"\",VLOOKUP(G8,入力制限シート!A$7:C$33,2,FALSE))","v":""},{"$f":"IF(G8=\"\",\"\",VLOOKUP(G8,入力制限シート!A$7:C$33,3,FALSE))","v":""}]
[null,null,null,null,null,null,null,{"$f":"IF(G9=\"\",\"\",VLOOKUP(G9,入力制限シート!A$7:C$33,2,FALSE))","v":""},{"$f":"IF(G9=\"\",\"\",VLOOKUP(G9,入力制限シート!A$7:C$33,3,FALSE))","v":""}]
[null,null,null,null,null,null,null,{"$f":"IF(G10=\"\",\"\",VLOOKUP(G10,入力制限シート!A$7:C$33,2,FALSE))","v":""},{"$f":"IF(G10=\"\",\"\",VLOOKUP(G10,入力制限シート!A$7:C$33,3,FALSE))","v":""}]
[null,null,null,null,null,null,null,{"$f":"IF(G11=\"\",\"\",VLOOKUP(G11,入力制限シート!A$7:C$33,2,FALSE))","v":""},{"$f":"IF(G11=\"\",\"\",VLOOKUP(G11,入力制限シート!A$7:C$33,3,FALSE))","v":""}]
[null,null,null,null,null,null,null,{"$f":"IF(G12=\"\",\"\",VLOOKUP(G12,入力制限シート!A$7:C$33,2,FALSE))","v":""},{"$f":"IF(G12=\"\",\"\",VLOOKUP(G12,入力制限シート!A$7:C$33,3,FALSE))","v":""}]
[null,null,null,null,null,null,null,{"$f":"IF(G13=\"\",\"\",VLOOKUP(G13,入力制限シート!A$7:C$33,2,FALSE))","v":""},{"$f":"IF(G13=\"\",\"\",VLOOKUP(G13,入力制限シート!A$7:C$33,3,FALSE))","v":""}]
[null,null,null,null,null,null,null,{"$f":"IF(G14=\"\",\"\",VLOOKUP(G14,入力制限シート!A$7:C$33,2,FALSE))","v":""},{"$f":"IF(G14=\"\",\"\",VLOOKUP(G14,入力制限シート!A$7:C$33,3,FALSE))","v":""}]
[null,null,null,null,null,null,null,{"$f":"IF(G15=\"\",\"\",VLOOKUP(G15,入力制限シート!A$7:C$33,2,FALSE))","v":""},{"$f":"IF(G15=\"\",\"\",VLOOKUP(G15,入力制限シート!A$7:C$33,3,FALSE))","v":""}]
[null,null,null,null,null,null,null,{"$f":"IF(G16=\"\",\"\",VLOOKUP(G16,入力制限シート!A$7:C$33,2,FALSE))","v":""},{"$f":"IF(G16=\"\",\"\",VLOOKUP(G16,入力制限シート!A$7:C$33,3,FALSE))","v":""}]
[null,null,null,null,null,null,null,{"$f":"IF(G17=\"\",\"\",VLOOKUP(G17,入力制限シート!A$7:C$33,2,FALSE))","v":""},{"$f":"IF(G17=\"\",\"\",VLOOKUP(G17,入力制限シート!A$7:C$33,3,FALSE))","v":""}]
[null,null,null,null,null,null,null,{"$f":"IF(G18=\"\",\"\",VLOOKUP(G18,入力制限シート!A$7:C$33,2,FALSE))","v":""},{"$f":"IF(G18=\"\",\"\",VLOOKUP(G18,入力制限シート!A$7:C$33,3,FALSE))","v":""}]
[null,null,null,null,null,null,null,{"$f":"IF(G19=\"\",\"\",VLOOKUP(G19,入力制限シート!A$7:C$33,2,FALSE))","v":""},{"$f":"IF(G19=\"\",\"\",VLOOKUP(G19,入力制限シート!A$7:C$33,3,FALSE))","v":""}]
[null,null,null,null,null,null,null,{"$f":"IF(G20=\"\",\"\",VLOOKUP(G20,入力制限シート!A$7:C$33,2,FALSE))","v":""},{"$f":"IF(G20=\"\",\"\",VLOOKUP(G20,入力制限シート!A$7:C$33,3,FALSE))","v":""}]
[null,null,null,null,null,null,null,{"$f":"IF(G21=\"\",\"\",VLOOKUP(G21,入力制限シート!A$7:C$33,2,FALSE))","v":""},{"$f":"IF(G21=\"\",\"\",VLOOKUP(G21,入力制限シート!A$7:C$33,3,FALSE))","v":""}]
[null,null,null,null,null,null,null,{"$f":"IF(G22=\"\",\"\",VLOOKUP(G22,入力制限シート!A$7:C$33,2,FALSE))","v":""},{"$f":"IF(G22=\"\",\"\",VLOOKUP(G22,入力制限シート!A$7:C$33,3,FALSE))","v":""}]
[null,null,null,null,null,null,null,{"$f":"IF(G23=\"\",\"\",VLOOKUP(G23,入力制限シート!A$7:C$33,2,FALSE))","v":""},{"$f":"IF(G23=\"\",\"\",VLOOKUP(G23,入力制限シート!A$7:C$33,3,FALSE))","v":""}]
[null,null,null,null,null,null,null,{"$f":"IF(G24=\"\",\"\",VLOOKUP(G24,入力制限シート!A$7:C$33,2,FALSE))","v":""},{"$f":"IF(G24=\"\",\"\",VLOOKUP(G24,入力制限シート!A$7:C$33,3,FALSE))","v":""}]
[null,null,null,null,null,null,null,{"$f":"IF(G25=\"\",\"\",VLOOKUP(G25,入力制限シート!A$7:C$33,2,FALSE))","v":""},{"$f":"IF(G25=\"\",\"\",VLOOKUP(G25,入力制限シート!A$7:C$33,3,FALSE))","v":""}]
[null,null,null,null,null,null,null,{"$f":"IF(G26=\"\",\"\",VLOOKUP(G26,入力制限シート!A$7:C$33,2,FALSE))","v":""},{"$f":"IF(G26=\"\",\"\",VLOOKUP(G26,入力制限シート!A$7:C$33,3,FALSE))","v":""}]
[null,null,null,null,null,null,null,{"$f":"IF(G27=\"\",\"\",VLOOKUP(G27,入力制限シート!A$7:C$33,2,FALSE))","v":""},{"$f":"IF(G27=\"\",\"\",VLOOKUP(G27,入力制限シート!A$7:C$33,3,FALSE))","v":""}]
[null,null,null,null,null,null,null,{"$f":"IF(G28=\"\",\"\",VLOOKUP(G28,入力制限シート!A$7:C$33,2,FALSE))","v":""},{"$f":"IF(G28=\"\",\"\",VLOOKUP(G28,入力制限シート!A$7:C$33,3,FALSE))","v":""}]
[null,null,null,null,null,null,null,{"$f":"IF(G29=\"\",\"\",VLOOKUP(G29,入力制限シート!A$7:C$33,2,FALSE))","v":""},{"$f":"IF(G29=\"\",\"\",VLOOKUP(G29,入力制限シート!A$7:C$33,3,FALSE))","v":""}]
[null,null,null,null,null,null,null,{"$f":"IF(G30=\"\",\"\",VLOOKUP(G30,入力制限シート!A$7:C$33,2,FALSE))","v":""},{"$f":"IF(G30=\"\",\"\",VLOOKUP(G30,入力制限シート!A$7:C$33,3,FALSE))","v":""}]
[null,null,null,null,null,null,null,{"$f":"IF(G31=\"\",\"\",VLOOKUP(G31,入力制限シート!A$7:C$33,2,FALSE))","v":""},{"$f":"IF(G31=\"\",\"\",VLOOKUP(G31,入力制限シート!A$7:C$33,3,FALSE))","v":""}]
[null,null,null,null,null,null,null,{"$f":"IF(G32=\"\",\"\",VLOOKUP(G32,入力制限シート!A$7:C$33,2,FALSE))","v":""},{"$f":"IF(G32=\"\",\"\",VLOOKUP(G32,入力制限シート!A$7:C$33,3,FALSE))","v":""}]
[null,null,null,null,null,null,null,{"$f":"IF(G33=\"\",\"\",VLOOKUP(G33,入力制限シート!A$7:C$33,2,FALSE))","v":""},{"$f":"IF(G33=\"\",\"\",VLOOKUP(G33,入力制限シート!A$7:C$33,3,FALSE))","v":""}]
[null,null,null,null,null,null,null,{"$f":"IF(G34=\"\",\"\",VLOOKUP(G34,入力制限シート!A$7:C$33,2,FALSE))","v":""},{"$f":"IF(G34=\"\",\"\",VLOOKUP(G34,入力制限シート!A$7:C$33,3,FALSE))","v":""}]
[null,null,null,null,null,null,null,{"$f":"IF(G35=\"\",\"\",VLOOKUP(G35,入力制限シート!A$7:C$33,2,FALSE))","v":""},{"$f":"IF(G35=\"\",\"\",VLOOKUP(G35,入力制限シート!A$7:C$33,3,FALSE))","v":""}]
[null,null,null,null,null,null,null,{"$f":"IF(G36=\"\",\"\",VLOOKUP(G36,入力制限シート!A$7:C$33,2,FALSE))","v":""},{"$f":"IF(G36=\"\",\"\",VLOOKUP(G36,入力制限シート!A$7:C$33,3,FALSE))","v":""}]
[null,null,null,null,null,null,null,{"$f":"IF(G37=\"\",\"\",VLOOKUP(G37,入力制限シート!A$7:C$33,2,FALSE))","v":""},{"$f":"IF(G37=\"\",\"\",VLOOKUP(G37,入力制限シート!A$7:C$33,3,FALSE))","v":""}]
[null,null,null,null,null,null,null,{"$f":"IF(G38=\"\",\"\",VLOOKUP(G38,入力制限シート!A$7:C$33,2,FALSE))","v":""},{"$f":"IF(G38=\"\",\"\",VLOOKUP(G38,入力制限シート!A$7:C$33,3,FALSE))","v":""}]
[null,null,null,null,null,null,null,{"$f":"IF(G39=\"\",\"\",VLOOKUP(G39,入力制限シート!A$7:C$33,2,FALSE))","v":""},{"$f":"IF(G39=\"\",\"\",VLOOKUP(G39,入力制限シート!A$7:C$33,3,FALSE))","v":""}]
[null,null,null,null,null,null,null,{"$f":"IF(G40=\"\",\"\",VLOOKUP(G40,入力制限シート!A$7:C$33,2,FALSE))","v":""},{"$f":"IF(G40=\"\",\"\",VLOOKUP(G40,入力制限シート!A$7:C$33,3,FALSE))","v":""}]
{"$rows_left_out":90}
{"sheet":"アンケート調査用紙","index":2,"n_rows":100,"n_cols":12,"rows_kept":100,"cut":false,"hidden":false,"merged":[]}
["観察場所（メッシュか緯度経度）",null,null,null,"青く塗った部分に入力ください",null,null,null,"メッシュを調べるHP　http://www.gis-tool.com/mapview/areameshmap.html"]
["メッシュ番号","緯度","経度","観察年","月","日","観察者","種名","繁殖区分","観察コード","繁殖ランク","備考"]
[null,null,null,null,null,null,null,null,null,{"$f":"IF(I3=\"\",\"\",VLOOKUP(I3,入力制限シート!A$7:C$33,2,FALSE))","v":""},{"$f":"IF(I3=\"\",\"\",VLOOKUP(I3,入力制限シート!A$7:C$33,3,FALSE))","v":""}]
[null,null,null,null,null,null,null,null,null,{"$f":"IF(I4=\"\",\"\",VLOOKUP(I4,入力制限シート!A$7:C$33,2,FALSE))","v":""},{"$f":"IF(I4=\"\",\"\",VLOOKUP(I4,入力制限シート!A$7:C$33,3,FALSE))","v":""}]
[null,null,null,null,null,null,null,null,null,{"$f":"IF(I5=\"\",\"\",VLOOKUP(I5,入力制限シート!A$7:C$33,2,FALSE))","v":""},{"$f":"IF(I5=\"\",\"\",VLOOKUP(I5,入力制限シート!A$7:C$33,3,FALSE))","v":""}]
[null,null,null,null,null,null,null,null,null,{"$f":"IF(I6=\"\",\"\",VLOOKUP(I6,入力制限シート!A$7:C$33,2,FALSE))","v":""},{"$f":"IF(I6=\"\",\"\",VLOOKUP(I6,入力制限シート!A$7:C$33,3,FALSE))","v":""}]
[null,null,null,null,null,null,null,null,null,{"$f":"IF(I7=\"\",\"\",VLOOKUP(I7,入力制限シート!A$7:C$33,2,FALSE))","v":""},{"$f":"IF(I7=\"\",\"\",VLOOKUP(I7,入力制限シート!A$7:C$33,3,FALSE))","v":""}]
[null,null,null,null,null,null,null,null,null,{"$f":"IF(I8=\"\",\"\",VLOOKUP(I8,入力制限シート!A$7:C$33,2,FALSE))","v":""},{"$f":"IF(I8=\"\",\"\",VLOOKUP(I8,入力制限シート!A$7:C$33,3,FALSE))","v":""}]
[null,null,null,null,null,null,null,null,null,{"$f":"IF(I9=\"\",\"\",VLOOKUP(I9,入力制限シート!A$7:C$33,2,FALSE))","v":""},{"$f":"IF(I9=\"\",\"\",VLOOKUP(I9,入力制限シート!A$7:C$33,3,FALSE))","v":""}]
[null,null,null,null,null,null,null,null,null,{"$f":"IF(I10=\"\",\"\",VLOOKUP(I10,入力制限シート!A$7:C$33,2,FALSE))","v":""},{"$f":"IF(I10=\"\",\"\",VLOOKUP(I10,入力制限シート!A$7:C$33,3,FALSE))","v":""}]
[null,null,null,null,null,null,null,null,null,{"$f":"IF(I11=\"\",\"\",VLOOKUP(I11,入力制限シート!A$7:C$33,2,FALSE))","v":""},{"$f":"IF(I11=\"\",\"\",VLOOKUP(I11,入力制限シート!A$7:C$33,3,FALSE))","v":""}]
[null,null,null,null,null,null,null,null,null,{"$f":"IF(I12=\"\",\"\",VLOOKUP(I12,入力制限シート!A$7:C$33,2,FALSE))","v":""},{"$f":"IF(I12=\"\",\"\",VLOOKUP(I12,入力制限シート!A$7:C$33,3,FALSE))","v":""}]
[null,null,null,null,null,null,null,null,null,{"$f":"IF(I13=\"\",\"\",VLOOKUP(I13,入力制限シート!A$7:C$33,2,FALSE))","v":""},{"$f":"IF(I13=\"\",\"\",VLOOKUP(I13,入力制限シート!A$7:C$33,3,FALSE))","v":""}]
[null,null,null,null,null,null,null,null,null,{"$f":"IF(I14=\"\",\"\",VLOOKUP(I14,入力制限シート!A$7:C$33,2,FALSE))","v":""},{"$f":"IF(I14=\"\",\"\",VLOOKUP(I14,入力制限シート!A$7:C$33,3,FALSE))","v":""}]
[null,null,null,null,null,null,null,null,null,{"$f":"IF(I15=\"\",\"\",VLOOKUP(I15,入力制限シート!A$7:C$33,2,FALSE))","v":""},{"$f":"IF(I15=\"\",\"\",VLOOKUP(I15,入力制限シート!A$7:C$33,3,FALSE))","v":""}]
[null,null,null,null,null,null,null,null,null,{"$f":"IF(I16=\"\",\"\",VLOOKUP(I16,入力制限シート!A$7:C$33,2,FALSE))","v":""},{"$f":"IF(I16=\"\",\"\",VLOOKUP(I16,入力制限シート!A$7:C$33,3,FALSE))","v":""}]
[null,null,null,null,null,null,null,null,null,{"$f":"IF(I17=\"\",\"\",VLOOKUP(I17,入力制限シート!A$7:C$33,2,FALSE))","v":""},{"$f":"IF(I17=\"\",\"\",VLOOKUP(I17,入力制限シート!A$7:C$33,3,FALSE))","v":""}]
[null,null,null,null,null,null,null,null,null,{"$f":"IF(I18=\"\",\"\",VLOOKUP(I18,入力制限シート!A$7:C$33,2,FALSE))","v":""},{"$f":"IF(I18=\"\",\"\",VLOOKUP(I18,入力制限シート!A$7:C$33,3,FALSE))","v":""}]
[null,null,null,null,null,null,null,null,null,{"$f":"IF(I19=\"\",\"\",VLOOKUP(I19,入力制限シート!A$7:C$33,2,FALSE))","v":""},{"$f":"IF(I19=\"\",\"\",VLOOKUP(I19,入力制限シート!A$7:C$33,3,FALSE))","v":""}]
[null,null,null,null,null,null,null,null,null,{"$f":"IF(I20=\"\",\"\",VLOOKUP(I20,入力制限シート!A$7:C$33,2,FALSE))","v":""},{"$f":"IF(I20=\"\",\"\",VLOOKUP(I20,入力制限シート!A$7:C$33,3,FALSE))","v":""}]
[null,null,null,null,null,null,null,null,null,{"$f":"IF(I21=\"\",\"\",VLOOKUP(I21,入力制限シート!A$7:C$33,2,FALSE))","v":""},{"$f":"IF(I21=\"\",\"\",VLOOKUP(I21,入力制限シート!A$7:C$33,3,FALSE))","v":""}]
[null,null,null,null,null,null,null,null,null,{"$f":"IF(I22=\"\",\"\",VLOOKUP(I22,入力制限シート!A$7:C$33,2,FALSE))","v":""},{"$f":"IF(I22=\"\",\"\",VLOOKUP(I22,入力制限シート!A$7:C$33,3,FALSE))","v":""}]
[null,null,null,null,null,null,null,null,null,{"$f":"IF(I23=\"\",\"\",VLOOKUP(I23,入力制限シート!A$7:C$33,2,FALSE))","v":""},{"$f":"IF(I23=\"\",\"\",VLOOKUP(I23,入力制限シート!A$7:C$33,3,FALSE))","v":""}]
[null,null,null,null,null,null,null,null,null,{"$f":"IF(I24=\"\",\"\",VLOOKUP(I24,入力制限シート!A$7:C$33,2,FALSE))","v":""},{"$f":"IF(I24=\"\",\"\",VLOOKUP(I24,入力制限シート!A$7:C$33,3,FALSE))","v":""}]
[null,null,null,null,null,null,null,null,null,{"$f":"IF(I25=\"\",\"\",VLOOKUP(I25,入力制限シート!A$7:C$33,2,FALSE))","v":""},{"$f":"IF(I25=\"\",\"\",VLOOKUP(I25,入力制限シート!A$7:C$33,3,FALSE))","v":""}]
[null,null,null,null,null,null,null,null,null,{"$f":"IF(I26=\"\",\"\",VLOOKUP(I26,入力制限シート!A$7:C$33,2,FALSE))","v":""},{"$f":"IF(I26=\"\",\"\",VLOOKUP(I26,入力制限シート!A$7:C$33,3,FALSE))","v":""}]
[null,null,null,null,null,null,null,null,null,{"$f":"IF(I27=\"\",\"\",VLOOKUP(I27,入力制限シート!A$7:C$33,2,FALSE))","v":""},{"$f":"IF(I27=\"\",\"\",VLOOKUP(I27,入力制限シート!A$7:C$33,3,FALSE))","v":""}]
[null,null,null,null,null,null,null,null,null,{"$f":"IF(I28=\"\",\"\",VLOOKUP(I28,入力制限シート!A$7:C$33,2,FALSE))","v":""},{"$f":"IF(I28=\"\",\"\",VLOOKUP(I28,入力制限シート!A$7:C$33,3,FALSE))","v":""}]
[null,null,null,null,null,null,null,null,null,{"$f":"IF(I29=\"\",\"\",VLOOKUP(I29,入力制限シート!A$7:C$33,2,FALSE))","v":""},{"$f":"IF(I29=\"\",\"\",VLOOKUP(I29,入力制限シート!A$7:C$33,3,FALSE))","v":""}]
[null,null,null,null,null,null,null,null,null,{"$f":"IF(I30=\"\",\"\",VLOOKUP(I30,入力制限シート!A$7:C$33,2,FALSE))","v":""},{"$f":"IF(I30=\"\",\"\",VLOOKUP(I30,入力制限シート!A$7:C$33,3,FALSE))","v":""}]
[null,null,null,null,null,null,null,null,null,{"$f":"IF(I31=\"\",\"\",VLOOKUP(I31,入力制限シート!A$7:C$33,2,FALSE))","v":""},{"$f":"IF(I31=\"\",\"\",VLOOKUP(I31,入力制限シート!A$7:C$33,3,FALSE))","v":""}]
[null,null,null,null,null,null,null,null,null,{"$f":"IF(I32=\"\",\"\",VLOOKUP(I32,入力制限シート!A$7:C$33,2,FALSE))","v":""},{"$f":"IF(I32=\"\",\"\",VLOOKUP(I32,入力制限シート!A$7:C$33,3,FALSE))","v":""}]
[null,null,null,null,null,null,null,null,null,{"$f":"IF(I33=\"\",\"\",VLOOKUP(I33,入力制限シート!A$7:C$33,2,FALSE))","v":""},{"$f":"IF(I33=\"\",\"\",VLOOKUP(I33,入力制限シート!A$7:C$33,3,FALSE))","v":""}]
[null,null,null,null,null,null,null,null,null,{"$f":"IF(I34=\"\",\"\",VLOOKUP(I34,入力制限シート!A$7:C$33,2,FALSE))","v":""},{"$f":"IF(I34=\"\",\"\",VLOOKUP(I34,入力制限シート!A$7:C$33,3,FALSE))","v":""}]
[null,null,null,null,null,null,null,null,null,{"$f":"IF(I35=\"\",\"\",VLOOKUP(I35,入力制限シート!A$7:C$33,2,FALSE))","v":""},{"$f":"IF(I35=\"\",\"\",VLOOKUP(I35,入力制限シート!A$7:C$33,3,FALSE))","v":""}]
[null,null,null,null,null,null,null,null,null,{"$f":"IF(I36=\"\",\"\",VLOOKUP(I36,入力制限シート!A$7:C$33,2,FALSE))","v":""},{"$f":"IF(I36=\"\",\"\",VLOOKUP(I36,入力制限シート!A$7:C$33,3,FALSE))","v":""}]
[null,null,null,null,null,null,null,null,null,{"$f":"IF(I37=\"\",\"\",VLOOKUP(I37,入力制限シート!A$7:C$33,2,FALSE))","v":""},{"$f":"IF(I37=\"\",\"\",VLOOKUP(I37,入力制限シート!A$7:C$33,3,FALSE))","v":""}]
[null,null,null,null,null,null,null,null,null,{"$f":"IF(I38=\"\",\"\",VLOOKUP(I38,入力制限シート!A$7:C$33,2,FALSE))","v":""},{"$f":"IF(I38=\"\",\"\",VLOOKUP(I38,入力制限シート!A$7:C$33,3,FALSE))","v":""}]
[null,null,null,null,null,null,null,null,null,{"$f":"IF(I39=\"\",\"\",VLOOKUP(I39,入力制限シート!A$7:C$33,2,FALSE))","v":""},{"$f":"IF(I39=\"\",\"\",VLOOKUP(I39,入力制限シート!A$7:C$33,3,FALSE))","v":""}]
[null,null,null,null,null,null,null,null,null,{"$f":"IF(I40=\"\",\"\",VLOOKUP(I40,入力制限シート!A$7:C$33,2,FALSE))","v":""},{"$f":"IF(I40=\"\",\"\",VLOOKUP(I40,入力制限シート!A$7:C$33,3,FALSE))","v":""}]
{"$rows_left_out":61}
{"sheet":"調査用紙","index":3,"n_rows":36,"n_cols":7,"rows_kept":36,"cut":false,"hidden":false,"merged":[[5,3,5,5],[0,0,0,6]]}
["全国鳥類繁殖分布調査　調査用紙"]
[]
["　　　　年　　　月　　　日　　　　　：　　　～　　　：　　　　　　　　　天候"]
["調査ルート番号　　　　　　　　　　　　　",null,null,null,null,"調査者名"]
[]
[null,null,null,"個体数"]
["調査種別","時刻","種名","50ｍ内","以遠","幼","繁殖行動"]
[null,null,null,null,null,null,"さえずり・餌運搬・"]
[null,null,null,null,null,null,"さえずり・餌運搬・"]
[null,null,null,null,null,null,"さえずり・餌運搬・"]
[null,null,null,null,null,null,"さえずり・餌運搬・"]
[null,null,null,null,null,null,"さえずり・餌運搬・"]
[null,null,null,null,null,null,"さえずり・餌運搬・"]
[null,null,null,null,null,null,"さえずり・餌運搬・"]
[null,null,null,null,null,null,"さえずり・餌運搬・"]
[null,null,null,null,null,null,"さえずり・餌運搬・"]
[null,null,null,null,null,null,"さえずり・餌運搬・"]
[null,null,null,null,null,null,"さえずり・餌運搬・"]
[null,null,null,null,null,null,"さえずり・餌運搬・"]
[null,null,null,null,null,null,"さえずり・餌運搬・"]
[null,null,null,null,null,null,"さえずり・餌運搬・"]
[null,null,null,null,null,null,"さえずり・餌運搬・"]
[null,null,null,null,null,null,"さえずり・餌運搬・"]
[null,null,null,null,null,null,"さえずり・餌運搬・"]
[null,null,null,null,null,null,"さえずり・餌運搬・"]
[null,null,null,null,null,null,"さえずり・餌運搬・"]
[null,null,null,null,null,null,"さえずり・餌運搬・"]
[null,null,null,null,null,null,"さえずり・餌運搬・"]
[null,null,null,null,null,null,"さえずり・餌運搬・"]
[null,null,null,null,null,null,"さえずり・餌運搬・"]
[null,null,null,null,null,null,"さえずり・餌運搬・"]
[null,null,null,null,null,null,"さえずり・餌運搬・"]
[null,null,null,null,null,null,"さえずり・餌運搬・"]
[null,null,null,null,null,null,"さえずり・餌運搬・"]
[null,null,null,null,null,null,"さえずり・餌運搬・"]
[null,null,null,null,null,null,"さえずり・餌運搬・"]

{"sheet":"入力制限シート","index":4,"n_rows":717,"n_cols":6,"rows_kept":717,"cut":false,"hidden":false,"merged":[]}
[null,null,null,null,"エゾライチョウ","Tetrastes bonasia"]
["ルート",null,null,null,"ライチョウ","Lagopus muta"]
["定点１",null,null,null,"ウズラ","Coturnix japonica"]
["定点２",null,null,null,"ヤマドリ","Syrmaticus soemmerringii"]
["定点３",null,null,null,"キジ","Phasianus colchicus"]
[null,null,null,null,"リュウキュウガモ","Dendrocygna javanica"]
["成鳥が巣あるいは巣のあるらしい所にくり返し出入りしている",10,"A",null,"サカツラガン","Anser cygnoides"]
["成鳥が抱卵又は抱雛している。あるいはしているようだ",11,"A",null,"ヒシクイ","Anser fabalis"]
["成鳥が巣のあるらしい所にとびこむと同時にヒナの餌をねだる声がきかれた",12,"A",null,"オオヒシクイ","Anser fabalis middendorffii"]
["成鳥がヒナのフンを運搬している",13,"A",null,"ハイイロガン","Anser anser"]
["成鳥が巣のヒナに餌を運搬している（餌をくわえたまま観察者を警戒し移動する気配のない場合を含む）",14,"A",null,"マガン","Anser albifrons"]
["擬傷をみた",15,"A",null,"カリガネ","Anser erythropus"]
["巣立ち後の巣がある。ただし2016 年以降に使用された巣であること",16,"A",null,"インドガン","Anser indicus"]
["卵のある巣をみた",17,"A",null,"ハクガン","Anser caerulescens"]
["成鳥がおちついてすわっている巣の近くで、その種が営巣し得る環境でその種の卵殻がみつかった",18,"A",null,"ミカドガン","Anser canagicus"]
["ヒナのいる巣を見た",19,"A",null,"シジュウカラガン","Branta hutchinsii"]
["ヒナの声をきいた",20,"A",null,"コクガン","Branta bernicla"]
["巣からほとんど移動していないと思われる巣立ちビナを見た",21,"A",null,"コブハクチョウ","Cygnus olor"]
["その種が営巣し得る環境で繁殖期に、その種のさえずり（キツツキ類のドラミングを含める）を聞いた。ただし、その鳥が冬鳥、旅鳥かもしれない時は除く",30,"B",null,"ナキハクチョウ","Cygnus buccinator"]
["求愛行動をみた。ただし、その鳥が冬鳥、旅鳥かもしれない時は除く",31,"B",null,"コハクチョウ","Cygnus columbianus"]
["交尾行動をみた。ただし、その鳥が冬鳥、旅鳥かもしれない時は除く",32,"B",null,"アメリカコハクチョウ"]
["威嚇行動、警戒行動により、付近に巣又はヒナの存在が考えられる",33,"B",null,"オオハクチョウ","Cygnus cygnus"]
["巣があると思われる所に成鳥が訪れた。ただし、そこが塒（ねぐら）である場合は除く",34,"B",null,"ツクシガモ","Tadorna tadorna"]
["造巣行動（巣穴堀りを含む）を見た",35,"B",null,"アカツクシガモ","Tadorna ferruginea"]
["成鳥が巣材を運搬している。ただし、明らかに周囲で巣を構えていると思われる場合に限る",36,"B",null,"カンムリツクシガモ","Tadorna cristata"]
["成鳥がヒナへの餌を運搬しているが、巣が周囲にあるかどうかわからない",37,"B",null,"オシドリ","Aix galericulata"]
["巣を発見したが、卵、ヒナともなく、成鳥がそこに来るのを認めなかった",38,"B",null,"ナンキンオシ","Nettapus coromandelianus"]
["かなり移動可能と思われる巣立ちビナを見た",39,"B",null,"オカヨシガモ","Anas strepera"]
["家族群を見た",40,"B",null,"ヨシガモ","Anas falcata"]
["その種が営巣し得る環境で繁殖期にその種を確認したが、他には繁殖の兆候が認められない。ただし冬鳥または旅鳥は過去にその地方で繁殖の記録があるもの",50,"C",null,"ヒドリガモ","Anas penelope"]
["繁殖期に鳴き声を確認したが、さえずりかどうかわからない",51,"C",null,"アメリカヒドリ","Anas americana"]
["その種の生息を確認したが、その周囲にその種が営巣し得る環境はないと思われる。例）アマツバメ類、ワシタカ類の上空通過を確認したが、周囲には営巣可能な環境はないと考えられる場合",60,"D",null,"マガモ","Anas platyrhynchos"]
["冬鳥または旅鳥で、繁殖期に生息がみられたが、過去にその地方で繁殖の記録がないもの",61,"D",null,"アカノドカルガモ","Anas luzonica"]
[null,null,null,null,"カルガモ","Anas zonorhyncha"]
[null,null,null,null,"ミカヅキシマアジ","Anas discors"]
[null,null,null,null,"ハシビロガモ","Anas clypeata"]
[null,null,null,null,"オナガガモ","Anas acuta"]
[null,null,null,null,"シマアジ","Anas querquedula"]
[null,null,null,null,"トモエガモ","Anas formosa"]
[null,null,null,null,"コガモ","Anas crecca"]
{"$rows_left_out":678}
{"sheet":"Sheet3","index":5,"n_rows":0,"n_cols":0,"rows_kept":0,"cut":false,"hidden":false,"merged":[]}